Target
Androgen receptor
Ligand
BDBM150277
Substrate
Meas. Tech.
Binding Assay
IC50
61±n/a nM
Citation
 Klar, UKuhnke, JBohlmann, RHübner, JRing, SFrenzel, TMenges, FBorden, SMuhn, HPrelle, K 19-nor-steroid derivatives with a 15α,16α-methylene group and a saturated 17,17-spirolactone ring, use thereof, and medicaments containing said derivatives US Patent  US8987239 Publication Date 3/24/2015 
Target
Name:
Androgen receptor
Synonyms:
ANDR_HUMAN Androgen Receptor Androgen receptor/Baculoviral IAP repeat-containing protein 2 Dihydrotestosterone receptor Nuclear receptor subfamily 3 group C member 4
Type:
Receptor
Mol. Mass.:
99185.27
Organism:
Homo sapiens (Human)
Description:
CHO cells were stably transfected with human AR gene.
Residue:
920
  
Inhibitor
Name:
BDBM150277
Synonyms:
US8987239, 3
Type:
Small organic molecule
Emp. Form.:
C23H30O3
Mol. Mass.:
354.4825
SMILES:
CC1CC2=CC(=O)CCC2C2CC[C@@]3(C)C(C4CC4[C@@]33CCC(=O)O3)C12
: