Target
Coagulation factor IX
Ligand
BDBM150289
Substrate
Meas. Tech.
Inhibition Assay
pH
8±n/a
Temperature
298.15±n/a K
IC50
20±n/a nM
Comments
extracted
Citation
 Chackalamannil, SChan, TChelliah, MVClasby, MCDwyer, MGreenlee, WJHirabayashi, TNeelamkavil, SNishida, HSaitoh, FShah, UXia, Y Morpholinone compounds as factor IXA inhibitors US Patent  US8987242 Publication Date 3/24/2015 
Target
Name:
Coagulation factor IX
Synonyms:
Christmas factor Coagulation factor IX/VIII Coagulation factor IXa heavy chain F9 Factor IX Factor IXa (fIXa) Plasma thromboplastin component
Type:
Enzyme
Mol. Mass.:
51768.83
Organism:
Homo sapiens (Human)
Description:
P00740
Residue:
461
  
Inhibitor
Name:
BDBM150289
Synonyms:
US8987242, 15
Type:
Small organic molecule
Emp. Form.:
C25H30N4O4
Mol. Mass.:
450.5301
SMILES:
NC(=N)c1ccc(NC(=O)[C@H](O)[C@H]2OCCN(C2=O)c2ccc(cc2)C2CCCCC2)cc1
: