Target
Coagulation factor IX
Ligand
BDBM150293
Substrate
Meas. Tech.
Inhibition Assay
pH
8±n/a
Temperature
298.15±n/a K
IC50
30±n/a nM
Comments
extracted
Citation
 Chackalamannil, SChan, TChelliah, MVClasby, MCDwyer, MGreenlee, WJHirabayashi, TNeelamkavil, SNishida, HSaitoh, FShah, UXia, Y Morpholinone compounds as factor IXA inhibitors US Patent  US8987242 Publication Date 3/24/2015 
Target
Name:
Coagulation factor IX
Synonyms:
Christmas factor Coagulation factor IX/VIII Coagulation factor IXa heavy chain F9 Factor IX Factor IXa (fIXa) Plasma thromboplastin component
Type:
Enzyme
Mol. Mass.:
51768.83
Organism:
Homo sapiens (Human)
Description:
P00740
Residue:
461
  
Inhibitor
Name:
BDBM150293
Synonyms:
US8987242, 114
Type:
Small organic molecule
Emp. Form.:
C21H24N4O4
Mol. Mass.:
396.4397
SMILES:
Cc1ccc(cc1)N1CCCO[C@H]([C@@H](O)C(=O)Nc2ccc(cc2)C(N)=N)C1=O
: