Target
Cytochrome P450 11B1, mitochondrial
Ligand
BDBM286211
Substrate
Meas. Tech.
Inhibition Assay
IC50
63.0±n/a nM
Citation
 Ali, ABennett, DJCai, JCarswell, ECooke, AHoyt, SBLo, MLondon, CMacLean, JPark, MKRatcliffe, PTaylor, JAWhitehead, BXiong, Y Imidazopyridyl compounds as aldosterone synthase inhibitors US Patent  US9518055 Publication Date 12/13/2016 
Target
Name:
Cytochrome P450 11B1, mitochondrial
Synonyms:
C11B1_HUMAN CYPXIB1 Cytochrome P450 11B1 Cytochrome P450 11B1, mitochondrial | S11BH
Type:
Enzyme
Mol. Mass.:
57591.44
Organism:
Homo sapiens (Human)
Description:
P15538
Residue:
503
  
Inhibitor
Name:
BDBM286211
Synonyms:
6-fluoro-2-(4-methylpyridin-3- yl)imidazo[1,2-a]pyridine | US9518055, Example 6
Type:
Small organic molecule
Emp. Form.:
C13H10FN3
Mol. Mass.:
227.237
SMILES:
Cc1ccncc1-c1cn2cc(F)ccc2n1
: