Target
Cytochrome P450 11B1, mitochondrial
Ligand
BDBM286223
Substrate
Meas. Tech.
Inhibition Assay
IC50
135±n/a nM
Citation
 Ali, ABennett, DJCai, JCarswell, ECooke, AHoyt, SBLo, MLondon, CMacLean, JPark, MKRatcliffe, PTaylor, JAWhitehead, BXiong, Y Imidazopyridyl compounds as aldosterone synthase inhibitors US Patent  US9518055 Publication Date 12/13/2016 
Target
Name:
Cytochrome P450 11B1, mitochondrial
Synonyms:
C11B1_HUMAN CYPXIB1 Cytochrome P450 11B1 Cytochrome P450 11B1, mitochondrial | S11BH
Type:
Enzyme
Mol. Mass.:
57591.44
Organism:
Homo sapiens (Human)
Description:
P15538
Residue:
503
  
Inhibitor
Name:
BDBM286223
Synonyms:
6-fluoro-3-methyl-2-(4- methylpyridin-3-yl)imidazo[1,2- a]pyridine | US9518055, Example 20
Type:
Small organic molecule
Emp. Form.:
C14H12FN3
Mol. Mass.:
241.2636
SMILES:
Cc1c(nc2ccc(F)cn12)-c1cnccc1C
: