Target
Cytochrome P450 11B1, mitochondrial
Ligand
BDBM50206957
Substrate
Meas. Tech.
Inhibition Assay
IC50
1023±n/a nM
Citation
 Ali, ABennett, DJCai, JCarswell, ECooke, AHoyt, SBLo, MLondon, CMacLean, JPark, MKRatcliffe, PTaylor, JAWhitehead, BXiong, Y Imidazopyridyl compounds as aldosterone synthase inhibitors US Patent  US9518055 Publication Date 12/13/2016 
Target
Name:
Cytochrome P450 11B1, mitochondrial
Synonyms:
C11B1_HUMAN CYPXIB1 Cytochrome P450 11B1 Cytochrome P450 11B1, mitochondrial | S11BH
Type:
Enzyme
Mol. Mass.:
57591.44
Organism:
Homo sapiens (Human)
Description:
P15538
Residue:
503
  
Inhibitor
Name:
BDBM50206957
Synonyms:
CHEMBL3902584 | US9518055, Example 35
Type:
Small organic molecule
Emp. Form.:
C16H11F4N3
Mol. Mass.:
321.2723
SMILES:
Fc1ccc2nc(c(C3CC3)n2c1)-c1cncc(c1)C(F)(F)F
: