Target
Cytochrome P450 11B1, mitochondrial
Ligand
BDBM286237
Substrate
Meas. Tech.
Inhibition Assay
IC50
1122±n/a nM
Citation
 Ali, ABennett, DJCai, JCarswell, ECooke, AHoyt, SBLo, MLondon, CMacLean, JPark, MKRatcliffe, PTaylor, JAWhitehead, BXiong, Y Imidazopyridyl compounds as aldosterone synthase inhibitors US Patent  US9518055 Publication Date 12/13/2016 
Target
Name:
Cytochrome P450 11B1, mitochondrial
Synonyms:
C11B1_HUMAN CYPXIB1 Cytochrome P450 11B1 Cytochrome P450 11B1, mitochondrial | S11BH
Type:
Enzyme
Mol. Mass.:
57591.44
Organism:
Homo sapiens (Human)
Description:
P15538
Residue:
503
  
Inhibitor
Name:
BDBM286237
Synonyms:
2-(5-(3-cyclopropyl-6- fluoroimidazo[1,2-a]pyridin-2- yl)pyridin-3-yl)-1,1,1- trifluoropropan-2-ol | US9518055, Example 38
Type:
Small organic molecule
Emp. Form.:
C18H15F4N3O
Mol. Mass.:
365.3248
SMILES:
CC(O)(c1cncc(c1)-c1nc2ccc(F)cn2c1C1CC1)C(F)(F)F
: