Target
Juvenile hormone epoxide hydrolase
Ligand
BDBM150786
Substrate
Meas. Tech.
Quantitative Reverse Transcriptase Assay
IC50
6.5e+3± 9e+2 nM
Citation
 Nollmann, FIHeinrich, AKBrachmann, AOMorisseau, CMukherjee, KCasanova-Torres, ÁMStrobl, FKleinhans, DKinski, SSchultz, KBeeton, MLKaiser, MChu, YYPhan Ke, LThanwisai, ABozhyk, KAChantratita, NGtz, FWaterfield, NRVilcinskas, AStelzer, EHGoodrich-Blair, HHammock, BDBode, HB A photorhabdus natural product inhibits insect juvenile hormone epoxide hydrolase. Chembiochem 16:766-71 (2015)  
Target
Name:
Juvenile hormone epoxide hydrolase
Synonyms:
HYEP_MANSE | Juvenile hormone epoxide hydrolase (JHEH)
Type:
Protein
Mol. Mass.:
52614.17
Organism:
Manduca sexta (Tobacco hornworm)
Description:
Residue:
462
  
Inhibitor
Name:
BDBM150786
Synonyms:
N-Methyl-N-(9-methyldecyl) urea (1)
Type:
Small organic molecule
Emp. Form.:
C13H28N2O
Mol. Mass.:
228.3742
SMILES:
CNC(=O)NCCCCCCCCC(C)C
: