Target
Juvenile hormone epoxide hydrolase
Ligand
BDBM129249
Substrate
Meas. Tech.
Quantitative Reverse Transcriptase Assay
IC50
2.3e+3± 6e+2 nM
Citation
 Nollmann, FIHeinrich, AKBrachmann, AOMorisseau, CMukherjee, KCasanova-Torres, ÁMStrobl, FKleinhans, DKinski, SSchultz, KBeeton, MLKaiser, MChu, YYPhan Ke, LThanwisai, ABozhyk, KAChantratita, NGtz, FWaterfield, NRVilcinskas, AStelzer, EHGoodrich-Blair, HHammock, BDBode, HB A photorhabdus natural product inhibits insect juvenile hormone epoxide hydrolase. Chembiochem 16:766-71 (2015)  
Target
Name:
Juvenile hormone epoxide hydrolase
Synonyms:
HYEP_MANSE | Juvenile hormone epoxide hydrolase (JHEH)
Type:
Protein
Mol. Mass.:
52614.17
Organism:
Manduca sexta (Tobacco hornworm)
Description:
Residue:
462
  
Inhibitor
Name:
BDBM129249
Synonyms:
US8815951, 478
Type:
Small organic molecule
Emp. Form.:
C17H36N2O
Mol. Mass.:
284.4805
SMILES:
CCCCCCCCCCCCNC(=O)NCC(C)C
: