Target
Gag-Pol polyprotein
Ligand
BDBM151089
Substrate
Meas. Tech.
Integrase Assay
IC50
23900±n/a nM
Citation
 Danter, WThrelfall, CGuizzetti, SMarin, J Compounds and method for treatment of HIV US Patent  US8987272 Publication Date 3/24/2015 
Target
Name:
Gag-Pol polyprotein
Synonyms:
Integrase gag-pol
Type:
Protein
Mol. Mass.:
161130.06
Organism:
Human immunodeficiency virus type 1 (HIV-1)
Description:
P24740
Residue:
1428
  
Inhibitor
Name:
BDBM151089
Synonyms:
US8987272, COTI-HIV28233
Type:
Small organic molecule
Emp. Form.:
C17H13FN6O2
Mol. Mass.:
352.3225
SMILES:
Cn1nc(-c2nnc(Cc3ccc(F)cc3)o2)\c(=N\O)c2ncccc12
: