Target
Protein-tyrosine kinase 2-beta
Ligand
BDBM286267
Substrate
Meas. Tech.
Inhibition Assay
pH
7.4±n/a
Ki
5.43±n/a nM
Comments
extracted
Citation
 Li, HNukui, SScales, SATeng, MYin, C Substituted pyrrolo[3,4-c]pyrazoles as PKC kinase inhibitors US Patent  US9518060 Publication Date 12/13/2016 
Target
Name:
Protein-tyrosine kinase 2-beta
Synonyms:
FAK2 PTK2B PTK2B protein tyrosine kinase 2 beta (PTK2B) Protein tyrosine kinase 2 beta | RAFTK
Type:
Protein
Mol. Mass.:
115868.80
Organism:
Homo sapiens (Human)
Description:
Q14289
Residue:
1009
  
Inhibitor
Name:
BDBM286267
Synonyms:
N-(2-ethyl-5-fluoropyrimidin-4-yl)-6,6-dimethyl-5-{[(2S)-2,4,5,5-tetramethylpiperazin-1-yl]carbonyl}-1,4,5,6-tetrahydropyrrolo[3,4-c]pyrazol-3-amine | US9518060, Example D1
Type:
Small organic molecule
Emp. Form.:
C23H34FN7O
Mol. Mass.:
443.5608
SMILES:
CCc1ccc(F)c(Nc2n[nH]c3c2CN(C(=O)N2CC(C)(C)N(C)C[C@@H]2C)C3(C)C)n1
: