Target
Protein-tyrosine kinase 2-beta
Ligand
BDBM286275
Substrate
Meas. Tech.
Inhibition Assay
pH
7.4±n/a
Ki
25.4±n/a nM
Comments
extracted
Citation
 Li, HNukui, SScales, SATeng, MYin, C Substituted pyrrolo[3,4-c]pyrazoles as PKC kinase inhibitors US Patent  US9518060 Publication Date 12/13/2016 
Target
Name:
Protein-tyrosine kinase 2-beta
Synonyms:
FAK2 PTK2B PTK2B protein tyrosine kinase 2 beta (PTK2B) Protein tyrosine kinase 2 beta | RAFTK
Type:
Protein
Mol. Mass.:
115868.80
Organism:
Homo sapiens (Human)
Description:
Q14289
Residue:
1009
  
Inhibitor
Name:
BDBM286275
Synonyms:
N-(2-ethyl-5-fluoropyrimidin-4-yl)-5-[(4-fluoro-1-methylpiperidin-4-yl)carbonyl]-dimethyl-1,4,5,6-tetrahydropyrrolo[3,4-c]pyrazol-3-amine US11780853, Example G1 | US9518060, Example G1
Type:
Small organic molecule
Emp. Form.:
C20H27F2N7O
Mol. Mass.:
419.4715
SMILES:
CCc1ncc(F)c(Nc2n[nH]c3c2CN(C(=O)C2(F)CCN(C)CC2)C3(C)C)n1
: