Target
Protein-tyrosine kinase 2-beta
Ligand
BDBM286337
Substrate
Meas. Tech.
Inhibition Assay
pH
7.4±n/a
Ki
19.2±n/a nM
Comments
extracted
Citation
 Li, HNukui, SScales, SATeng, MYin, C Substituted pyrrolo[3,4-c]pyrazoles as PKC kinase inhibitors US Patent  US9518060 Publication Date 12/13/2016 
Target
Name:
Protein-tyrosine kinase 2-beta
Synonyms:
FAK2 PTK2B PTK2B protein tyrosine kinase 2 beta (PTK2B) Protein tyrosine kinase 2 beta | RAFTK
Type:
Protein
Mol. Mass.:
115868.80
Organism:
Homo sapiens (Human)
Description:
Q14289
Residue:
1009
  
Inhibitor
Name:
BDBM286337
Synonyms:
US11220518, Ex. No. J14 US9518060, Example J14
Type:
Small organic molecule
Emp. Form.:
C25H38N8O3
Mol. Mass.:
498.621
SMILES:
COc1ccnc(Nc2n[nH]c3c2CN(C(=O)N2C[C@@H](C)N(CC4CCOCC4)C[C@@H]2C)C3(C)C)n1
: