Target
Protein-tyrosine kinase 2-beta
Ligand
BDBM286358
Substrate
Meas. Tech.
Inhibition Assay
pH
7.4±n/a
Ki
38.4±n/a nM
Comments
extracted
Citation
 Li, HNukui, SScales, SATeng, MYin, C Substituted pyrrolo[3,4-c]pyrazoles as PKC kinase inhibitors US Patent  US9518060 Publication Date 12/13/2016 
Target
Name:
Protein-tyrosine kinase 2-beta
Synonyms:
FAK2 PTK2B PTK2B protein tyrosine kinase 2 beta (PTK2B) Protein tyrosine kinase 2 beta | RAFTK
Type:
Protein
Mol. Mass.:
115868.80
Organism:
Homo sapiens (Human)
Description:
Q14289
Residue:
1009
  
Inhibitor
Name:
BDBM286358
Synonyms:
US9518060, Example K16
Type:
Small organic molecule
Emp. Form.:
C20H29FN8O2
Mol. Mass.:
432.4951
SMILES:
CCOc1ncc(F)c(Nc2n[nH]c3c2CN(C(=O)N2CCN(C)C(C)C2)C3(C)C)n1
: