Target
Endothelial lipase
Ligand
BDBM151463
Substrate
Meas. Tech.
Biological Assay
pH
8±n/a
Temperature
298.15±n/a K
IC50
1.7±n/a nM
Comments
extracted
Citation
 Finlay, HJiang, JKim, SParkhurst, BQiao, JXWang, TCPi, ZTora, GOLloyd, JJohnson, JA Amide, urea or sulfone amide linked benzothiazole inhibitors of endothelial lipase US Patent  US8987314 Publication Date 3/24/2015 
Target
Name:
Endothelial lipase
Synonyms:
EDL Endothelial cell-derived lipase LIPG
Type:
Protein
Mol. Mass.:
56805.62
Organism:
Homo sapiens (Human)
Description:
Q9Y5X9
Residue:
500
  
Inhibitor
Name:
BDBM151463
Synonyms:
US8987314, B274
Type:
Small organic molecule
Emp. Form.:
C24H29N3O7S3
Mol. Mass.:
567.698
SMILES:
Cc1cc2nc(sc2cc1-c1ccc(cc1)C(=O)OC(C)(C)C)C(C(=O)NCCS(N)(=O)=O)S(C)(=O)=O
: