Target
Endothelial lipase
Ligand
BDBM151541
Substrate
Meas. Tech.
Biological Assay
pH
8±n/a
Temperature
298.15±n/a K
IC50
0.8±n/a nM
Comments
extracted
Citation
 Finlay, HJiang, JKim, SParkhurst, BQiao, JXWang, TCPi, ZTora, GOLloyd, JJohnson, JA Amide, urea or sulfone amide linked benzothiazole inhibitors of endothelial lipase US Patent  US8987314 Publication Date 3/24/2015 
Target
Name:
Endothelial lipase
Synonyms:
EDL Endothelial cell-derived lipase LIPG
Type:
Protein
Mol. Mass.:
56805.62
Organism:
Homo sapiens (Human)
Description:
Q9Y5X9
Residue:
500
  
Inhibitor
Name:
BDBM151541
Synonyms:
US8987314, B352
Type:
Small organic molecule
Emp. Form.:
C18H18FN3O5S3
Mol. Mass.:
471.546
SMILES:
CS(=O)(=O)C(C(=O)NCCS(N)(=O)=O)c1nc2cc(ccc2s1)-c1ccccc1F
: