Target
Hepatic triacylglycerol lipase
Ligand
BDBM151292
Substrate
Meas. Tech.
Biological Assay
pH
8±n/a
Temperature
298.15±n/a K
IC50
2.2±n/a nM
Comments
extracted
Citation
 Finlay, HJiang, JKim, SParkhurst, BQiao, JXWang, TCPi, ZTora, GOLloyd, JJohnson, JA Amide, urea or sulfone amide linked benzothiazole inhibitors of endothelial lipase US Patent  US8987314 Publication Date 3/24/2015 
Target
Name:
Hepatic triacylglycerol lipase
Synonyms:
HL Hepatic Lipase (HL) Hepatic triacylglycerol lipase LIPC_HUMAN | Lipase member C
Type:
Protein
Mol. Mass.:
55938.55
Organism:
Homo sapiens (Human)
Description:
P11150
Residue:
499
  
Inhibitor
Name:
BDBM151292
Synonyms:
US8987314, B88
Type:
Small organic molecule
Emp. Form.:
C18H20N4O6S3
Mol. Mass.:
484.57
SMILES:
COc1cc(ccn1)-c1ccc2sc(nc2c1)C(C(=O)NCCS(N)(=O)=O)S(C)(=O)=O
: