Target
Hepatic triacylglycerol lipase
Ligand
BDBM151463
Substrate
Meas. Tech.
Biological Assay
pH
8±n/a
Temperature
298.15±n/a K
IC50
5.1±n/a nM
Comments
extracted
Citation
 Finlay, HJiang, JKim, SParkhurst, BQiao, JXWang, TCPi, ZTora, GOLloyd, JJohnson, JA Amide, urea or sulfone amide linked benzothiazole inhibitors of endothelial lipase US Patent  US8987314 Publication Date 3/24/2015 
Target
Name:
Hepatic triacylglycerol lipase
Synonyms:
HL Hepatic Lipase (HL) Hepatic triacylglycerol lipase LIPC_HUMAN | Lipase member C
Type:
Protein
Mol. Mass.:
55938.55
Organism:
Homo sapiens (Human)
Description:
P11150
Residue:
499
  
Inhibitor
Name:
BDBM151463
Synonyms:
US8987314, B274
Type:
Small organic molecule
Emp. Form.:
C24H29N3O7S3
Mol. Mass.:
567.698
SMILES:
Cc1cc2nc(sc2cc1-c1ccc(cc1)C(=O)OC(C)(C)C)C(C(=O)NCCS(N)(=O)=O)S(C)(=O)=O
: