Target
Hepatic triacylglycerol lipase
Ligand
BDBM151468
Substrate
Meas. Tech.
Biological Assay
pH
8±n/a
Temperature
298.15±n/a K
IC50
2.8±n/a nM
Comments
extracted
Citation
 Finlay, HJiang, JKim, SParkhurst, BQiao, JXWang, TCPi, ZTora, GOLloyd, JJohnson, JA Amide, urea or sulfone amide linked benzothiazole inhibitors of endothelial lipase US Patent  US8987314 Publication Date 3/24/2015 
Target
Name:
Hepatic triacylglycerol lipase
Synonyms:
HL Hepatic Lipase (HL) Hepatic triacylglycerol lipase LIPC_HUMAN | Lipase member C
Type:
Protein
Mol. Mass.:
55938.55
Organism:
Homo sapiens (Human)
Description:
P11150
Residue:
499
  
Inhibitor
Name:
BDBM151468
Synonyms:
US8987314, B279
Type:
Small organic molecule
Emp. Form.:
C25H26N4O5S3
Mol. Mass.:
558.693
SMILES:
Cc1nnc(CNC(=O)C(c2nc3ccc(cc3s2)-c2ccc(cc2)C(=O)OC(C)(C)C)S(C)(=O)=O)s1
: