Target
Serine/threonine-protein kinase pim-1
Ligand
BDBM151941
Substrate
Meas. Tech.
AlphaScreen Assay
IC50
0.02±n/a nM
Citation
 Burger, MDrumm, III, JENishiguchi, GRico, ASimmons, RLTaft, BTanner, H Ring-substituted N-pyridinyl amides as kinase inhibitors US Patent  US8987457 Publication Date 3/24/2015 
Target
Name:
Serine/threonine-protein kinase pim-1
Synonyms:
PIM-1 Kinase PIM1_HUMAN Serine/threonine-protein kinase (PIM1) Serine/threonine-protein kinase PIM1 | Serine/threonine-protein kinase pim-1 (PIM1)
Type:
Protein
Mol. Mass.:
35681.82
Organism:
Homo sapiens (Human)
Description:
P11309
Residue:
313
  
Inhibitor
Name:
BDBM151941
Synonyms:
US8987457, 135
Type:
Small organic molecule
Emp. Form.:
C25H29F2N5O4S2
Mol. Mass.:
565.656
SMILES:
C[C@H]1C[C@H](C[C@@H](N)[C@H]1OCCS(C)(=O)=O)c1ccncc1NC(=O)c1nc(sc1N)-c1c(F)cccc1F
: