Target
Serine/threonine-protein kinase pim-1
Ligand
BDBM151950
Substrate
Meas. Tech.
AlphaScreen Assay
IC50
0.02±n/a nM
Citation
 Burger, MDrumm, III, JENishiguchi, GRico, ASimmons, RLTaft, BTanner, H Ring-substituted N-pyridinyl amides as kinase inhibitors US Patent  US8987457 Publication Date 3/24/2015 
Target
Name:
Serine/threonine-protein kinase pim-1
Synonyms:
PIM-1 Kinase PIM1_HUMAN Serine/threonine-protein kinase (PIM1) Serine/threonine-protein kinase PIM1 | Serine/threonine-protein kinase pim-1 (PIM1)
Type:
Protein
Mol. Mass.:
35681.82
Organism:
Homo sapiens (Human)
Description:
P11309
Residue:
313
  
Inhibitor
Name:
BDBM151950
Synonyms:
US8987457, 144
Type:
Small organic molecule
Emp. Form.:
C28H31F3N4O5S
Mol. Mass.:
592.63
SMILES:
COc1cc(F)c(c(F)c1)-c1nc(ccc1F)C(=O)Nc1cnccc1[C@@H]1C[C@H](C)[C@H](OCCS(C)(=O)=O)[C@H](N)C1
: