Target
Serine/threonine-protein kinase pim-3
Ligand
BDBM151872
Substrate
Meas. Tech.
AlphaScreen Assay
IC50
0.73±n/a nM
Citation
 Burger, MDrumm, III, JENishiguchi, GRico, ASimmons, RLTaft, BTanner, H Ring-substituted N-pyridinyl amides as kinase inhibitors US Patent  US8987457 Publication Date 3/24/2015 
Target
Name:
Serine/threonine-protein kinase pim-3
Synonyms:
PIM3 Serine/threonine-protein kinase pim-3 (PIM3)
Type:
Protein
Mol. Mass.:
35888.19
Organism:
Homo sapiens (Human)
Description:
Q86V86
Residue:
326
  
Inhibitor
Name:
BDBM151872
Synonyms:
US8987457, 66
Type:
Small organic molecule
Emp. Form.:
C26H25F3N8O2
Mol. Mass.:
538.5243
SMILES:
C[C@H]1CN(C[C@@H](N)[C@H]1n1cc(CO)nn1)c1ccncc1NC(=O)c1ccc(F)c(n1)-c1c(F)cccc1F
: