Target
Serine/threonine-protein kinase pim-3
Ligand
BDBM151952
Substrate
Meas. Tech.
AlphaScreen Assay
IC50
0.39±n/a nM
Citation
 Burger, MDrumm, III, JENishiguchi, GRico, ASimmons, RLTaft, BTanner, H Ring-substituted N-pyridinyl amides as kinase inhibitors US Patent  US8987457 Publication Date 3/24/2015 
Target
Name:
Serine/threonine-protein kinase pim-3
Synonyms:
PIM3 Serine/threonine-protein kinase pim-3 (PIM3)
Type:
Protein
Mol. Mass.:
35888.19
Organism:
Homo sapiens (Human)
Description:
Q86V86
Residue:
326
  
Inhibitor
Name:
BDBM151952
Synonyms:
US8987457, 146
Type:
Small organic molecule
Emp. Form.:
C27H30F3N5O4S
Mol. Mass.:
577.618
SMILES:
C[C@H]1C[C@H](C[C@@H](N)[C@H]1OCCS(C)(=O)=O)c1ccncc1NC(=O)c1nc(c(F)cc1N)-c1c(F)cccc1F
: