Target
Serine/threonine-protein kinase pim-3
Ligand
BDBM151980
Substrate
Meas. Tech.
AlphaScreen Assay
IC50
0.41±n/a nM
Citation
 Burger, MDrumm, III, JENishiguchi, GRico, ASimmons, RLTaft, BTanner, H Ring-substituted N-pyridinyl amides as kinase inhibitors US Patent  US8987457 Publication Date 3/24/2015 
Target
Name:
Serine/threonine-protein kinase pim-3
Synonyms:
PIM3 Serine/threonine-protein kinase pim-3 (PIM3)
Type:
Protein
Mol. Mass.:
35888.19
Organism:
Homo sapiens (Human)
Description:
Q86V86
Residue:
326
  
Inhibitor
Name:
BDBM151980
Synonyms:
US8987457, 174
Type:
Small organic molecule
Emp. Form.:
C25H26F3N7O3
Mol. Mass.:
529.5142
SMILES:
COC(=O)N[C@H]1[C@@H](C)CN(C[C@H]1N)c1ccncc1NC(=O)c1nc(c(F)cc1N)-c1c(F)cccc1F
: