Target
Heat shock protein HSP 90-alpha
Ligand
BDBM152277
Substrate
Meas. Tech.
Biacore Assay
pH
7.6±n/a
Kd
0.3±n/a nM
Comments
extracted
Citation
 Brasca, MGCasale, EFerguson, RPolucci, PZuccotto, F Resorcinol derivatives as HSP90 inhibitors US Patent  US8993556 Publication Date 3/31/2015 
Target
Name:
Heat shock protein HSP 90-alpha
Synonyms:
HS90A_HUMAN HSP86 HSP90AA1 HSPCA Heat shock 86 kDa Heat shock protein HSP 90-alpha (HSP90) LAP-2 Lipopolysaccharide-associated protein 2 heat shock protein 90kDa alpha (cytosolic), class A member 1 isoform 2
Type:
Molecular Chaperone
Mol. Mass.:
84623.45
Organism:
Homo sapiens (Human)
Description:
P07900
Residue:
732
  
Inhibitor
Name:
BDBM152277
Synonyms:
US8993556, N-(1-Cyclohexylpiperidin-4-yl)-5-[2,4-dihydroxy-6-(4-nitrophenoxy)phenyl]isoxazole-3-carboxamide
Type:
Small organic molecule
Emp. Form.:
C27H30N4O7
Mol. Mass.:
522.5497
SMILES:
Oc1cc(O)c(-c2cc(no2)C(=O)NC2CCN(CC2)C2CCCCC2)c(Oc2ccc(cc2)[N+]([O-])=O)c1
: