Target
Thymidine phosphorylase
Ligand
BDBM152488
Substrate
Meas. Tech.
Thymidine Phosphorylase Inhibition Assay
pH
7.4±n/a
IC50
3.824e+4± 1.28e+3 nM
Comments
extracted
Citation
 Shahzad, SAYar, MBajda, MShahzadi, LKhan, ZANaqvi, SAMutahir, SMahmood, NKhan, KM Synthesis, thymidine phosphorylase inhibition and molecular modeling studies of 1,3,4-oxadiazole-2-thione derivatives. Bioorg Chem 60:37-41 (2015)  
Target
Name:
Thymidine phosphorylase
Synonyms:
TYPH_ECO57 deoA
Type:
Protein
Mol. Mass.:
47171.52
Organism:
Escherichia coli (Enterobacteria)
Description:
Residue:
440
  
Inhibitor
Name:
BDBM152488
Synonyms:
5(4'-Hydroxyphenyl)-1,3,4-oxadiazole-2(3H)-thione (6)
Type:
Small organic molecule
Emp. Form.:
C8H6N2O2S
Mol. Mass.:
194.21
SMILES:
Oc1ccc(cc1)-c1n[nH]c(=S)o1
: