Target
Genome polyprotein
Ligand
BDBM152642
Substrate
Meas. Tech.
DENV2 Protease Assay
pH
8.5±n/a
IC50
>1.00e+5±n/a nM
Comments
extracted
Citation
 Timiri, AKSelvarasu, SKesherwani, MVijayan, VSinha, BNDevadasan, VJayaprakash, V Synthesis and molecular modelling studies of novel sulphonamide derivatives as dengue virus 2 protease inhibitors. Bioorg Chem 62:74-82 (2015)  
Target
Name:
Genome polyprotein
Synonyms:
DENV2 protease (NS2B-NS3) | POLG_DEN2N
Type:
Protein
Mol. Mass.:
379567.99
Organism:
Dengue virus 2 (Virus)
Description:
P14340
Residue:
3391
  
Inhibitor
Name:
BDBM152642
Synonyms:
2-(4-(Piperidin-1-ylsulphonyl)phenyl)isoindoline-1,3-dione (5)
Type:
Small organic molecule
Emp. Form.:
C19H18N2O4S
Mol. Mass.:
370.422
SMILES:
O=C1N(C(=O)c2ccccc12)c1ccc(cc1)S(=O)(=O)N1CCCCC1
: