Target
Beta-lactamase [24-383]
Ligand
BDBM152695
Substrate
Meas. Tech.
Steady State Kinetics Assays
pH
7.4±0
Temperature
298.15±0 K
Ki
44.5±2.2 nM
Kd
590±0.0 nM
Citation
 Powers, RASwanson, HCTaracila, MAFlorek, NWRomagnoli, CCaselli, EPrati, FBonomo, RAWallar, BJ Biochemical and structural analysis of inhibitors targeting the ADC-7 cephalosporinase of Acinetobacter baumannii. Biochemistry 53:7670-9 (2014)  
Target
Name:
Beta-lactamase [24-383]
Synonyms:
ADC-7 beta-lactamase (ADC-7)
Type:
Protein
Mol. Mass.:
40642.04
Organism:
Acinetobacter baumannii (g-Proteobacteria)
Description:
A version of ADC-7 starting at amino acid 24.
Residue:
360
  
Inhibitor
Name:
BDBM152695
Synonyms:
S02030
Type:
Small organic molecule
Emp. Form.:
C11H13BN4O5S
Mol. Mass.:
324.121
SMILES:
OB(O)[C@H](Cn1cc(nn1)C(O)=O)NC(=O)Cc1cccs1
: