Target
Peptidyl-prolyl cis-trans isomerase B
Ligand
BDBM50030554
Substrate
Meas. Tech.
Surface Plasmon Resonance (SPR) Assay
pH
7.4±n/a
Kd
1.45±n/a nM
Comments
extracted
Citation
 Fu, JKarur, SLi, XLu, PMergo, WRivkin, ASweeney, ZKTjandra, MWeiss, AYifru, A Cyclic peptides and use as medicines US Patent  US9566312 Publication Date 2/14/2017 
Target
Name:
Peptidyl-prolyl cis-trans isomerase B
Synonyms:
CYP-S1 Cyclophilin B PPIB PPIase Rotamase SCYLP
Type:
Protein
Mol. Mass.:
23751.82
Organism:
Homo sapiens (Human)
Description:
P23284
Residue:
216
  
Inhibitor
Name:
BDBM50030554
Synonyms:
CHEMBL3344494 | US9566312, Compound 2.1
Type:
Small organic molecule
Emp. Form.:
C63H113N11O13
Mol. Mass.:
1232.6372
SMILES:
[H][C@@]1([C@H](C)COC)N(C)C(=O)[C@@H](C)N(C)C(=O)[C@H](CC)NC(=O)[C@]([H])([C@H](O)[C@H](C)C\C=C\C)N(C)C(=O)[C@H](C(C)C)N(C)C(=O)[C@H](CC(C)C)N(C)C(=O)[C@H](CC(C)C)N(C)C(=O)[C@@H](C)NC(=O)[C@H](C)NC(=O)[C@H](CC(C)C)N(C)C(=O)[C@@H](NC1=O)C(C)C
: