Target
Peptidyl-prolyl cis-trans isomerase B
Ligand
BDBM50030535
Substrate
Meas. Tech.
Surface Plasmon Resonance (SPR) Assay
pH
7.4±n/a
Kd
0.800±n/a nM
Comments
extracted
Citation
 Fu, JKarur, SLi, XLu, PMergo, WRivkin, ASweeney, ZKTjandra, MWeiss, AYifru, A Cyclic peptides and use as medicines US Patent  US9566312 Publication Date 2/14/2017 
Target
Name:
Peptidyl-prolyl cis-trans isomerase B
Synonyms:
CYP-S1 Cyclophilin B PPIB PPIase Rotamase SCYLP
Type:
Protein
Mol. Mass.:
23751.82
Organism:
Homo sapiens (Human)
Description:
P23284
Residue:
216
  
Inhibitor
Name:
BDBM50030535
Synonyms:
CHEMBL3344499 | US9566312, Compound 2.5.26
Type:
Small organic molecule
Emp. Form.:
C68H119N13O12
Mol. Mass.:
1310.7524
SMILES:
[H][C@@]1([C@H](C)CN2CCC(CC2)C#N)N(C)C(=O)[C@@H](C)N(C)C(=O)[C@H](CC)NC(=O)[C@]([H])([C@H](O)[C@H](C)C\C=C\C)N(C)C(=O)[C@H](C(C)C)N(C)C(=O)[C@H](CC(C)C)N(C)C(=O)[C@H](CC(C)C)N(C)C(=O)[C@@H](C)NC(=O)[C@H](C)NC(=O)[C@H](CC(C)C)N(C)C(=O)[C@@H](NC1=O)C(C)C
: