Target
Peptidyl-prolyl cis-trans isomerase F, mitochondrial
Ligand
BDBM286550
Substrate
Meas. Tech.
Surface Plasmon Resonance (SPR) Assay
pH
7.4±n/a
Kd
1.30±n/a nM
Comments
extracted
Citation
 Fu, JKarur, SLi, XLu, PMergo, WRivkin, ASweeney, ZKTjandra, MWeiss, AYifru, A Cyclic peptides and use as medicines US Patent  US9566312 Publication Date 2/14/2017 
Target
Name:
Peptidyl-prolyl cis-trans isomerase F, mitochondrial
Synonyms:
CYP3 CyP-M Cyclophilin F Mitochondrial cyclophilin PPIF_HUMAN Rotamase F
Type:
PROTEIN
Mol. Mass.:
22052.60
Organism:
Homo sapiens (Human)
Description:
ChEMBL_109465
Residue:
207
  
Inhibitor
Name:
BDBM286550
Synonyms:
US9566312, Compound 2.5.31
Type:
Small organic molecule
Emp. Form.:
C69H123N13O14
Mol. Mass.:
1358.7936
SMILES:
CCOC(=O)N1CCN(C[C@@H](C)[C@@H]2N(C)C(=O)[C@@H](C)N(C)C(=O)[C@H](CC)NC(=O)[C@H]([C@H](O)[C@H](C)C\C=C\C)N(C)C(=O)[C@H](C(C)C)N(C)C(=O)[C@H](CC(C)C)N(C)C(=O)[C@H](CC(C)C)N(C)C(=O)[C@@H](C)NC(=O)[C@H](C)NC(=O)[C@H](CC(C)C)N(C)C(=O)[C@@H](NC2=O)C(C)C)CC1
: