Target
Nitric oxide synthase oxygenase
Ligand
BDBM152709
Substrate
Meas. Tech.
Imidazole Spin Shift Assay
Kd
4.5e+2± 5e+1 nM
Citation
 Holden, JKDejam, DLewis, MCHuang, HKang, SJing, QXue, FSilverman, RBPoulos, TL Inhibitor Bound Crystal Structures of Bacterial Nitric Oxide Synthase. Biochemistry 54:4075-82 (2015)  
Target
Name:
Nitric oxide synthase oxygenase
Synonyms:
NOSO_BACSU nos | yflM
Type:
Protein
Mol. Mass.:
41892.66
Organism:
Bacillus subtilis (Firmicutes)
Description:
O34453
Residue:
363
  
Inhibitor
Name:
BDBM152709
Synonyms:
6-(5-{[(3R,4R)-4-[(6-amino-4-methylpyridin-2-yl)methyl]pyrrolidin-3-yl]oxy}pentyl)-4-methylpyridin-2-amine (4)
Type:
Small organic molecule
Emp. Form.:
C22H33N5O
Mol. Mass.:
383.5303
SMILES:
Cc1cc(N)nc(CCCCCO[C@H]2CNC[C@H]2Cc2cc(C)cc(N)n2)c1
: