Target
Neuraminidase
Ligand
BDBM5020
Substrate
BDBM4702
Meas. Tech.
Neuraminidase Inhibition Assay
pH
6.5±n/a
Temperature
310.15±n/a K
IC50
359±8 nM
Citation
 Chand, PKotian, PLDehghani, AEl-Kattan, YLin, THHutchison, TLBabu, YSBantia, SElliott, AJMontgomery, JA Systematic structure-based design and stereoselective synthesis of novel multisubstituted cyclopentane derivatives with potent antiinfluenza activity. J Med Chem 44:4379-92 (2001)  
Target
Name:
Neuraminidase
Synonyms:
Influenza A Virus Neuraminidase NRAM_I57A5 | Neuraminidase A
Type:
Enzyme
Mol. Mass.:
52000.86
Organism:
Influenza A virus (A/Singapore/1/57(H2N2))
Description:
Q6XUE4
Residue:
469
  
Inhibitor
Name:
BDBM5020
Synonyms:
(1S,3R,4R)-3-carbamimidamido-4-[(1S)-1-acetamidopentyl]cyclopentane-1-carboxylic acid | Cyclopentane Derivative 28b
Type:
Small organic molecule
Emp. Form.:
C14H26N4O3
Mol. Mass.:
298.3812
SMILES:
[H][C@@](CCCC)(NC(C)=O)[C@@H]1C[C@@H](C[C@H]1N=C(N)N)C(O)=O
:
Substrate
Name:
BDBM4702
Synonyms:
(2R,4S,5R,6R)-5-acetamido-4-hydroxy-2-[(4-methyl-2-oxo-2H-chromen-7-yl)oxy]-6-[(1R,2R)-1,2,3-trihydroxypropyl]oxane-2-carboxylic acid neuraminidase substrate
Type:
Small organic molecule
Emp. Form.:
C21H25NO11
Mol. Mass.:
467.4233
SMILES:
CC(=O)N[C@@H]1[C@@H](O)C[C@](Oc2ccc3c(C)cc(=O)oc3c2)(O[C@H]1[C@H](O)[C@H](O)CO)C(O)=O
: