Target
Epidermal growth factor receptor [1-973]
Ligand
BDBM152777
Substrate
Meas. Tech.
In vitro EGFR TK Inhibition Assays
Temperature
298.15±n/a K
IC50
22.4±2.49 nM
Comments
extracted
Citation
 Hu, MYe, WLi, JZhong, GHe, GXu, QZhang, Y Synthesis and evaluation of salicylanilide derivatives as potential epidermal growth factor receptor inhibitors. Chem Biol Drug Des 85:280-9 (2015)  
Target
Name:
Epidermal growth factor receptor [1-973]
Synonyms:
EGFR ERBB Epidermal growth factor receptor (EGFR) Receptor tyrosine-protein kinase erbB-1
Type:
Protein
Mol. Mass.:
108055.41
Organism:
Homo sapiens (Human)
Description:
P00533[1-973]
Residue:
973
  
Inhibitor
Name:
BDBM152777
Synonyms:
4-(3-(Piperidin-1-yl)propoxy)-N-(m-tolyl)-2-hydroxybenzamide (10b)
Type:
Small organic molecule
Emp. Form.:
C22H28N2O3
Mol. Mass.:
368.4693
SMILES:
Cc1cccc(NC(=O)c2ccc(OCCCN3CCCCC3)cc2O)c1
: