Target
Membrane metallo-endopeptidase-like 1
Ligand
BDBM130363
Substrate
Meas. Tech.
Inhibition Assay
pH
7.4±n/a
Temperature
298.15±n/a K
IC50
75±n/a nM
Comments
extracted
Citation
 Foo, SY Method of treating contrast-induced nephropathy US Patent  US8993631 Publication Date 3/31/2015 
Target
Name:
Membrane metallo-endopeptidase-like 1
Synonyms:
Endopeptidase (NEP) MMEL1 MMEL2 Neutral endopeptidase (NEP)
Type:
Enzyme
Mol. Mass.:
89358.76
Organism:
Homo sapiens (Human)
Description:
Q495T6
Residue:
779
  
Inhibitor
Name:
BDBM130363
Synonyms:
US8822534, Example 6-1 | US8993631, 6-1
Type:
Small organic molecule
Emp. Form.:
C20H21NO5
Mol. Mass.:
355.3844
SMILES:
OC(=O)CCNC(=O)[C@@H](CC(O)=O)Cc1ccc(cc1)-c1ccccc1
: