Target
Membrane metallo-endopeptidase-like 1
Ligand
BDBM153108
Substrate
Meas. Tech.
Inhibition Assay
pH
7.4±n/a
Temperature
298.15±n/a K
IC50
1±n/a nM
Comments
extracted
Citation
 Foo, SY Method of treating contrast-induced nephropathy US Patent  US8993631 Publication Date 3/31/2015 
Target
Name:
Membrane metallo-endopeptidase-like 1
Synonyms:
Endopeptidase (NEP) MMEL1 MMEL2 Neutral endopeptidase (NEP)
Type:
Enzyme
Mol. Mass.:
89358.76
Organism:
Homo sapiens (Human)
Description:
Q495T6
Residue:
779
  
Inhibitor
Name:
BDBM153108
Synonyms:
US8993631, 16-5 US9603819, Example 3-32
Type:
Small organic molecule
Emp. Form.:
C24H23N3O5
Mol. Mass.:
433.4565
SMILES:
C[C@H](C[C@@H](Cc1ccc(cc1)-c1ccccc1)NC(=O)c1cc(ncn1)C(O)=O)C(O)=O
: