Target
Membrane metallo-endopeptidase-like 1
Ligand
BDBM153114
Substrate
Meas. Tech.
Inhibition Assay
pH
7.4±n/a
Temperature
298.15±n/a K
IC50
350±n/a nM
Comments
extracted
Citation
 Foo, SY Method of treating contrast-induced nephropathy US Patent  US8993631 Publication Date 3/31/2015 
Target
Name:
Membrane metallo-endopeptidase-like 1
Synonyms:
Endopeptidase (NEP) MMEL1 MMEL2 Neutral endopeptidase (NEP)
Type:
Enzyme
Mol. Mass.:
89358.76
Organism:
Homo sapiens (Human)
Description:
Q495T6
Residue:
779
  
Inhibitor
Name:
BDBM153114
Synonyms:
US8993631, 17 US9603819, Example 5-1
Type:
Small organic molecule
Emp. Form.:
C25H23NO7
Mol. Mass.:
449.4526
SMILES:
C[C@H](C[C@@H](Cc1ccc(cc1)-c1ccccc1)NC(=O)c1cc(=O)cc(o1)C(O)=O)C(O)=O
: