Target
Tyrosine-protein kinase JAK3
Ligand
BDBM153187
Substrate
Meas. Tech.
HTRF Assay
Temperature
298.15±n/a K
IC50
0.68±n/a nM
Comments
extracted
Citation
 Ahearn, SPChristopher, MDinsmore, CJung, JPu, QRivkin, AScott, MEWitter, DJWoo, HCCash, B Pyrrolopyrimidines as janus kinase inhibitors US Patent  US8993756 Publication Date 3/31/2015 
Target
Name:
Tyrosine-protein kinase JAK3
Synonyms:
JAK-3 JAK3_HUMAN Janus kinase 3 (JAK3) L-JAK | Leukocyte janus kinase
Type:
Protein
Mol. Mass.:
125111.08
Organism:
Homo sapiens (Human)
Description:
P52333
Residue:
1124
  
Inhibitor
Name:
BDBM153187
Synonyms:
US8993756, 4-32
Type:
Small organic molecule
Emp. Form.:
C19H19N5O4
Mol. Mass.:
381.3853
SMILES:
CCOC(=O)c1c[nH]c2ncnc(-c3cnc(OC)c(NC(=O)C(C)=C)c3)c12
: