Target
Tyrosine-protein kinase JAK3
Ligand
BDBM153220
Substrate
Meas. Tech.
HTRF Assay
Temperature
298.15±n/a K
IC50
0.17±n/a nM
Comments
extracted
Citation
 Ahearn, SPChristopher, MDinsmore, CJung, JPu, QRivkin, AScott, MEWitter, DJWoo, HCCash, B Pyrrolopyrimidines as janus kinase inhibitors US Patent  US8993756 Publication Date 3/31/2015 
Target
Name:
Tyrosine-protein kinase JAK3
Synonyms:
JAK-3 JAK3_HUMAN Janus kinase 3 (JAK3) L-JAK | Leukocyte janus kinase
Type:
Protein
Mol. Mass.:
125111.08
Organism:
Homo sapiens (Human)
Description:
P52333
Residue:
1124
  
Inhibitor
Name:
BDBM153220
Synonyms:
US8993756, 20-1
Type:
Small organic molecule
Emp. Form.:
C23H20N4O
Mol. Mass.:
368.4311
SMILES:
CC(=C)C(=O)Nc1cccc(c1)-c1ncnc2[nH]cc(-c3cccc(C)c3)c12
: