Target
Tyrosine-protein kinase JAK3
Ligand
BDBM153222
Substrate
Meas. Tech.
HTRF Assay
Temperature
298.15±n/a K
IC50
0.96±n/a nM
Comments
extracted
Citation
 Ahearn, SPChristopher, MDinsmore, CJung, JPu, QRivkin, AScott, MEWitter, DJWoo, HCCash, B Pyrrolopyrimidines as janus kinase inhibitors US Patent  US8993756 Publication Date 3/31/2015 
Target
Name:
Tyrosine-protein kinase JAK3
Synonyms:
JAK-3 JAK3_HUMAN Janus kinase 3 (JAK3) L-JAK | Leukocyte janus kinase
Type:
Protein
Mol. Mass.:
125111.08
Organism:
Homo sapiens (Human)
Description:
P52333
Residue:
1124
  
Inhibitor
Name:
BDBM153222
Synonyms:
US8993756, 20-3
Type:
Small organic molecule
Emp. Form.:
C22H17FN4O
Mol. Mass.:
372.395
SMILES:
CC(=C)C(=O)Nc1cccc(c1)-c1ncnc2[nH]cc(-c3ccccc3F)c12
: