Target
Aurora kinase B
Ligand
BDBM153269
Substrate
Meas. Tech.
Aurora B Kinase Assay
IC50
2.85e+3±n/a nM
Citation
 Jung, YShin, SYYong, YJung, HAhn, SLee, YHLim, Y Plant-derived flavones as inhibitors of aurora B kinase and their quantitative structure-activity relationships. Chem Biol Drug Des 85:574-85 (2015)  
Target
Name:
Aurora kinase B
Synonyms:
AIK2 AIM1 ARK2 AURKB_HUMAN Aurora B-INCENP Aurora kinase B (AURKB) STK-1 STK12 Serine/threonine-protein kinase aurora B
Type:
Protein
Mol. Mass.:
39327.72
Organism:
Homo sapiens (Human)
Description:
Q96GD4
Residue:
344
  
Inhibitor
Name:
BDBM153269
Synonyms:
3,7-dihydroxy-2-(4-hydroxy-3-methoxyphenyl)chromen-4-one | Geraldol (13)
Type:
Small organic molecule
Emp. Form.:
C16H12O6
Mol. Mass.:
300.2629
SMILES:
COc1cc(ccc1O)-c1oc2cc(O)ccc2c(=O)c1O
: