Target
Epithelial discoidin domain-containing receptor 1
Ligand
BDBM286643
Substrate
Meas. Tech.
Binding Activity
Temperature
298.15±n/a K
IC50
18.0±n/a nM
Comments
extracted
Citation
 Murata, TKawada, HNiizuma, SHara, SHada, KShimada, HTanaka, HMio, T Quinazolinedione derivative US Patent  US9567304 Publication Date 2/14/2017 
Target
Name:
Epithelial discoidin domain-containing receptor 1
Synonyms:
CAK DDR1_HUMAN Discoidin domain-containing receptor 1 (DDR1) EDDR1 Epithelial discoidin domain receptor 1 (DDR1) Epithelial discoidin domain-containing receptor 1 (DDR1) Mammary carcinoma kinase 10 NTRK4 Protein-tyrosine kinase RTK 6 TRKE | Tyrosine-protein kinase CAK
Type:
Tyrosine-protein kinase
Mol. Mass.:
101130.02
Organism:
Homo sapiens (Human)
Description:
Q08345
Residue:
913
  
Inhibitor
Name:
BDBM286643
Synonyms:
3-(8-Bromo-2, 4-dioxo-6-trifluoromethyl-1,4-dihydro-2H-quinazolin-3-ylamino)-4-ethylsulfanyl-benzonitrile | US9567304, Compound A-2
Type:
Small organic molecule
Emp. Form.:
C18H12BrF3N4O2S
Mol. Mass.:
485.278
SMILES:
CCSc1ccc(cc1Nn1c(=O)[nH]c2c(Br)cc(cc2c1=O)C(F)(F)F)C#N
: