Target
Decaprenyl diphosphate synthase
Ligand
BDBM153305
Substrate
Meas. Tech.
DPPS Inhibition (cis FPP based) Assay
pH
7.5±n/a
IC50
1.1e+4±n/a nM
Comments
extracted
Citation
 Kim, MOFeng, XFeixas, FZhu, WLindert, SBogue, SSinko, Wde Oliveira, CRao, GOldfield, EMcCammon, JA A Molecular Dynamics Investigation of Mycobacterium tuberculosis Prenyl Synthases: Conformational Flexibility and Implications for Computer-aided Drug Discovery. Chem Biol Drug Des 85:756-69 (2015)  
Target
Name:
Decaprenyl diphosphate synthase
Synonyms:
DPDS_MYCTO uppS
Type:
Protein
Mol. Mass.:
33800.02
Organism:
Mycobacterium tuberculosis H37Rv
Description:
Residue:
296
  
Inhibitor
Name:
BDBM153305
Synonyms:
BPH-1264
Type:
Small organic molecule
Emp. Form.:
C22H26BrNO4
Mol. Mass.:
448.35
SMILES:
CCCCCCCCOc1cccc(c1)C(=O)Nc1ccc(Br)cc1C(O)=O
: