Target
Decaprenyl diphosphate synthase
Ligand
BDBM153314
Substrate
Meas. Tech.
DPPS Inhibition (cis FPP based) Assay
pH
7.5±n/a
IC50
2.0e+4±n/a nM
Comments
extracted
Citation
 Kim, MOFeng, XFeixas, FZhu, WLindert, SBogue, SSinko, Wde Oliveira, CRao, GOldfield, EMcCammon, JA A Molecular Dynamics Investigation of Mycobacterium tuberculosis Prenyl Synthases: Conformational Flexibility and Implications for Computer-aided Drug Discovery. Chem Biol Drug Des 85:756-69 (2015)  
Target
Name:
Decaprenyl diphosphate synthase
Synonyms:
DPDS_MYCTO uppS
Type:
Protein
Mol. Mass.:
33800.02
Organism:
Mycobacterium tuberculosis H37Rv
Description:
Residue:
296
  
Inhibitor
Name:
BDBM153314
Synonyms:
BPH-1485
Type:
Small organic molecule
Emp. Form.:
C22H25F2NO4
Mol. Mass.:
405.435
SMILES:
CCCCCCCCOc1ccc(F)c(c1)C(=O)Nc1ccc(F)cc1C(O)=O
: