Target
Lysine-specific histone demethylase 1A
Ligand
BDBM153464
Substrate
Meas. Tech.
Amplex Red Peroxide/Peroxidase-Coupled Assay
IC50
70±n/a nM
Citation
 Guibourt, NOrtega Munoz, ACastro-Palomino Laria, J Phenylcyclopropylamine derivatives and their medical use US Patent  US8993808 Publication Date 3/31/2015 
Target
Name:
Lysine-specific histone demethylase 1A
Synonyms:
AOF2 Flavin-containing amine oxidase domain-containing protein 2 KDM1A KIAA0601 Lysine-specific demethylase 1 (LSD1) Lysine-specific histone demethylase 1 (LSD1)
Type:
Enzyme
Mol. Mass.:
92901.01
Organism:
Homo sapiens (Human)
Description:
O60341
Residue:
852
  
Inhibitor
Name:
BDBM153464
Synonyms:
US8993808, 62
Type:
Small organic molecule
Emp. Form.:
C19H23NO
Mol. Mass.:
281.392
SMILES:
COc1ccc(CN[C@H]2CC2c2ccccc2)c(C)c1C
: