Target
Lysine-specific histone demethylase 1A
Ligand
BDBM153474
Substrate
Meas. Tech.
Amplex Red Peroxide/Peroxidase-Coupled Assay
IC50
5±n/a nM
Citation
 Guibourt, NOrtega Munoz, ACastro-Palomino Laria, J Phenylcyclopropylamine derivatives and their medical use US Patent  US8993808 Publication Date 3/31/2015 
Target
Name:
Lysine-specific histone demethylase 1A
Synonyms:
AOF2 Flavin-containing amine oxidase domain-containing protein 2 KDM1A KIAA0601 Lysine-specific demethylase 1 (LSD1) Lysine-specific histone demethylase 1 (LSD1)
Type:
Enzyme
Mol. Mass.:
92901.01
Organism:
Homo sapiens (Human)
Description:
O60341
Residue:
852
  
Inhibitor
Name:
BDBM153474
Synonyms:
US8993808, 76
Type:
Small organic molecule
Emp. Form.:
C19H21NO2
Mol. Mass.:
295.3755
SMILES:
CC(N[C@H]1CC1c1ccccc1)c1ccc2OCCOc2c1
: