Target
Interleukin-1 receptor-associated kinase 1
Ligand
BDBM286321
Substrate
Meas. Tech.
IRAK1 Enzymatic Assay
IC50
550±n/a nM
Citation
 Jorand-Lebrun, CKulkarni, SCrosignani, S Pyridazinone-amides derivatives US Patent  US9567320 Publication Date 2/14/2017 
Target
Name:
Interleukin-1 receptor-associated kinase 1
Synonyms:
IRAK IRAK1 Interleukin-1 receptor-associated kinase 1 (IRAK-1)
Type:
Enzyme
Mol. Mass.:
76536.81
Organism:
Homo sapiens (Human)
Description:
P51617
Residue:
712
  
Inhibitor
Name:
BDBM286321
Synonyms:
N-(5,6-dimethoxy-1H-benzo[d]imidazol-2-yl)-3-((6-oxo-3-(pyridin-3-yl)pyridazin-1(6H)-yl)methyl)benzamide | US9567320, Example 15
Type:
Small organic molecule
Emp. Form.:
C26H22N6O4
Mol. Mass.:
482.4907
SMILES:
COc1cc2nc(NC(=O)c3cccc(Cn4nc(ccc4=O)-c4cccnc4)c3)[nH]c2cc1OC
: