Target
Tyrosine-protein kinase receptor UFO
Ligand
BDBM153641
Substrate
Meas. Tech.
Binding Assay
pH
8±n/a
IC50
7042±n/a nM
Comments
extracted
Citation
 Schultz-Fademrecht, CKlebl, BChoidas, AKoch, UEickhoff, JWolf, AUllrich, A Pharmaceutically active compounds as Axl inhibitors US Patent  US8999982 Publication Date 4/7/2015 
Target
Name:
Tyrosine-protein kinase receptor UFO
Synonyms:
AXL TEL/AXL UFO | UFO_HUMAN
Type:
Enzyme
Mol. Mass.:
98316.97
Organism:
Homo sapiens (Human)
Description:
P30530
Residue:
894
  
Inhibitor
Name:
BDBM153641
Synonyms:
US8999982, Ref4
Type:
Small organic molecule
Emp. Form.:
C22H18N2O4S
Mol. Mass.:
406.454
SMILES:
COc1cc2nccc(Oc3ccc(NC(=O)c4ccsc4)cc3)c2cc1OC
: