Target
Amine oxidase [flavin-containing] B
Ligand
BDBM50359397
Substrate
Meas. Tech.
Inhibition Assay
pH
7.4±n/a
Temperature
310.15±n/a K
IC50
745400±n/a nM
Comments
extracted
Citation
 Samadi, AMarco Contelles, JLBolea Tomás, ILuque Garriga, FJUnzeta López, M Derivatives of propargylamine having neuroprotective capacity for the treatment of Alzheimer's and Parkinson's diseases US Patent  US8999994 Publication Date 4/7/2015 
Target
Name:
Amine oxidase [flavin-containing] B
Synonyms:
AOFB_RAT Amine oxidase [flavin-containing] B Monoamine Oxidase Type B (MAO-B) Monoamine oxidase B (MAO-B) Monoamine oxidase type B (MAOB) | Monoamine oxidase-B (MAO-B)
Type:
Enzyme
Mol. Mass.:
58469.65
Organism:
Rattus norvegicus (rat)
Description:
P19643
Residue:
520
  
Inhibitor
Name:
BDBM50359397
Synonyms:
CHEMBL1929419 | US8999994, 4
Type:
Small organic molecule
Emp. Form.:
C27H33N3O
Mol. Mass.:
415.5704
SMILES:
CN(CC#C)Cc1cc2cc(OCC3CCN(Cc4ccccc4)CC3)ccc2n1C
: