Target
Tyrosine-protein kinase JAK2
Ligand
BDBM153667
Substrate
Meas. Tech.
Inhibition Assay
pH
7.2±n/a
Ki
0.4±n/a nM
Comments
extracted
Citation
 Gibbons, PHanan, ELiu, WLyssikatos, JPMagnuson, SRMendonca, RPastor, RRawson, TESiu, MZak, MZhou, AZhu, B Pyrazolopyrimidine JAK inhibitor compounds and methods US Patent  US8999998 Publication Date 4/7/2015 
Target
Name:
Tyrosine-protein kinase JAK2
Synonyms:
JAK-2 JAK2_HUMAN Janus kinase 2 (JAK2) | Janus kinase 2 (a protein tyrosine kinase)
Type:
Protein
Mol. Mass.:
130684.68
Organism:
Homo sapiens (Human)
Description:
O60674
Residue:
1132
  
Inhibitor
Name:
BDBM153667
Synonyms:
US8999998, 170
Type:
Small organic molecule
Emp. Form.:
C18H14ClN5O2S
Mol. Mass.:
399.854
SMILES:
COc1ccc(Cl)cc1-c1nc(C)sc1NC(=O)c1cnn2cccnc12
: